*Heading
** Job name: dynamic-2 Model name: Model-1
** Generated by: Abaqus/CAE 6.14-1
*Preprint, echo=NO, model=NO, history=NO, contact=NO
**
** PARTS
**
*Part, name="FINAL CATYA-1"
*Node
*Element, type=C3D10
*Nset, nset=Set-1, generate
*Elset, elset=Set-1, generate
** Section: Section-1
*Solid Section, elset=Set-1, material=Material-1
*End Part
**
*Part, name="FINAL CATYA-2"
*Node
*Element, type=C3D10
*Nset, nset=Set-1, generate
*Elset, elset=Set-1, generate
** Section: Section-1
*Solid Section, elset=Set-1, material=Material-1
*End Part
**
*Part, name="FINAL CATYA-3"
*Node
*Element, type=C3D10
*Nset, nset=Set-1, generate
*Elset, elset=Set-1, generate
** Section: Section-1
*Solid Section, elset=Set-1, material=Material-1
*End Part
**
*Part, name="FINAL CATYA-4"
*Node
*Element, type=C3D10
*Nset, nset=Set-1, generate
*Elset, elset=Set-1, generate
** Section: Section-1
*Solid Section, elset=Set-1, material=Material-1
*End Part
**
*Part, name="FINAL CATYA-5"
*Node
*Element, type=C3D10
*Nset, nset=Set-1, generate
*Elset, elset=Set-1, generate
** Section: Section-1
*Solid Section, elset=Set-1, material=Material-1
*End Part
**
*Part, name="FINAL CATYA-6"
*Node
*Element, type=C3D10
*Nset, nset=Set-1, generate
*Elset, elset=Set-1, generate
** Section: Section-1
*Solid Section, elset=Set-1, material=Material-1
*End Part
**
*Part, name="FINAL CATYA-7"
*Node
*Element, type=C3D10
*Nset, nset=Set-1, generate
*Elset, elset=Set-1, generate
** Section: Section-1
*Solid Section, elset=Set-1, material=Material-1
*End Part
**
*Part, name="FINAL CATYA-8"
*Node
*Element, type=C3D10
*Nset, nset=Set-1, generate
*Elset, elset=Set-1, generate
** Section: Section-1
*Solid Section, elset=Set-1, material=Material-1
*End Part
**
*Part, name="FINAL CATYA-9"
*Node
*Element, type=C3D10
*Nset, nset=Set-1, generate
*Elset, elset=Set-1, generate
** Section: Section-1
*Solid Section, elset=Set-1, material=Material-1
*End Part
**
*Part, name="FINAL CATYA-10"
*Node
*Element, type=C3D10
*Nset, nset=Set-1, generate
*Elset, elset=Set-1, generate
** Section: Section-1
*Solid Section, elset=Set-1, material=Material-1
*End Part
**
*Part, name="FINAL CATYA-11"
*Node
*Element, type=C3D10
*Nset, nset=Set-1, generate
*Elset, elset=Set-1, generate
** Section: Section-1
*Solid Section, elset=Set-1, material=Material-1
*End Part
**
*Part, name="FINAL CATYA-12"
*Node
*Element, type=C3D10
*Nset, nset=Set-1, generate
*Elset, elset=Set-1, generate
** Section: Section-1
*Solid Section, elset=Set-1, material=Material-1
*End Part
**
*Part, name="FINAL CATYA-13"
*Node
*Element, type=C3D10
*Nset, nset=Set-1, generate
*Elset, elset=Set-1, generate
** Section: Section-1
*Solid Section, elset=Set-1, material=Material-1
*End Part
**
*Part, name="FINAL CATYA-14"
*Node
*Element, type=C3D10
*Nset, nset=Set-1, generate
*Elset, elset=Set-1, generate
** Section: Section-1
*Solid Section, elset=Set-1, material=Material-1
*End Part
**
*Part, name="FINAL CATYA-15"
*Node
*Element, type=C3D10
*Nset, nset=Set-1, generate
*Elset, elset=Set-1, generate
** Section: Section-1
*Solid Section, elset=Set-1, material=Material-1
*End Part
**
*Part, name="FINAL CATYA-16"
*Node
*Element, type=C3D8R
*Nset, nset=Set-1, generate
*Elset, elset=Set-1, generate
** Section: Section-1
*Solid Section, elset=Set-1, material=Material-1
*End Part
**
*Part, name="FINAL CATYA-17"
*Node
*Element, type=C3D10
*Nset, nset=Set-1, generate
*Elset, elset=Set-1, generate
** Section: Section-1
*Solid Section, elset=Set-1, material=Material-1
*End Part
**
*Part, name="FINAL CATYA-18"
*Node
*Element, type=C3D8R
*Nset, nset=Set-1, generate
*Elset, elset=Set-1, generate
** Section: Section-1
*Solid Section, elset=Set-1, material=Material-1
*End Part
**
*Part, name="FINAL CATYA-19"
*Node
*Element, type=C3D8R
*Nset, nset=Set-1, generate
*Elset, elset=Set-1, generate
** Section: Section-1
*Solid Section, elset=Set-1, material=Material-1
*End Part
**
*Part, name="FINAL CATYA-20"
*Node
*Element, type=C3D10
*Nset, nset=Set-1, generate
*Elset, elset=Set-1, generate
** Section: Section-1
*Solid Section, elset=Set-1, material=Material-1
*End Part
**
*Part, name="FINAL CATYA-21"
*Node
*Element, type=C3D10
*Nset, nset=Set-1, generate
*Elset, elset=Set-1, generate
** Section: Section-1
*Solid Section, elset=Set-1, material=Material-1
*End Part
**
*Part, name="FINAL CATYA-22"
*Node
*Element, type=C3D10
*Nset, nset=Set-1, generate
*Elset, elset=Set-1, generate
** Section: Section-1
*Solid Section, elset=Set-1, material=Material-1
*End Part
**
*Part, name="FINAL CATYA-23"
*Node
*Element, type=C3D10
*Nset, nset=Set-1, generate
*Elset, elset=Set-1, generate
** Section: Section-1
*Solid Section, elset=Set-1, material=Material-1
*End Part
**
*Part, name="FINAL CATYA-24"
*Node
*Element, type=C3D10
*Nset, nset=Set-1, generate
*Elset, elset=Set-1, generate
** Section: Section-1
*Solid Section, elset=Set-1, material=Material-1
*End Part
**
*Part, name="FINAL CATYA-25"
*Node
*Element, type=C3D10
*Nset, nset=Set-1, generate
*Elset, elset=Set-1, generate
** Section: Section-1
*Solid Section, elset=Set-1, material=Material-1
*End Part
**
*Part, name="FINAL CATYA-26"
*Node
*Element, type=C3D10
*Nset, nset=Set-1, generate
*Elset, elset=Set-1, generate
** Section: Section-1
*Solid Section, elset=Set-1, material=Material-1
*End Part
**
*Part, name="FINAL CATYA-27"
*Node
*Element, type=C3D10
*Nset, nset=Set-1, generate
*Elset, elset=Set-1, generate
** Section: Section-1
*Solid Section, elset=Set-1, material=Material-1
*End Part
**
*Part, name="FINAL CATYA-28"
*Node
*Element, type=C3D10
*Nset, nset=Set-1, generate
*Elset, elset=Set-1, generate
** Section: Section-1
*Solid Section, elset=Set-1, material=Material-1
*End Part
**
*Part, name="FINAL CATYA-29"
*Node
*Element, type=C3D10
*Nset, nset=Set-1, generate
*Elset, elset=Set-1, generate
** Section: Section-1
*Solid Section, elset=Set-1, material=Material-1
*End Part
**
**
** ASSEMBLY
**
*Assembly, name=Assembly
**
*Instance, name="FINAL CATYA-1-1", part="FINAL CATYA-1"
*End Instance
**
*Instance, name="FINAL CATYA-2-1", part="FINAL CATYA-2"
*End Instance
**
*Instance, name="FINAL CATYA-3-1", part="FINAL CATYA-3"
*End Instance
**
*Instance, name="FINAL CATYA-4-1", part="FINAL CATYA-4"
*End Instance
**
*Instance, name="FINAL CATYA-5-1", part="FINAL CATYA-5"
*End Instance
**
*Instance, name="FINAL CATYA-6-1", part="FINAL CATYA-6"
*End Instance
**
*Instance, name="FINAL CATYA-7-1", part="FINAL CATYA-7"
*End Instance
**
*Instance, name="FINAL CATYA-8-1", part="FINAL CATYA-8"
*End Instance
**
*Instance, name="FINAL CATYA-9-1", part="FINAL CATYA-9"
*End Instance
**
*Instance, name="FINAL CATYA-10-1", part="FINAL CATYA-10"
*End Instance
**
*Instance, name="FINAL CATYA-11-1", part="FINAL CATYA-11"
*End Instance
**
*Instance, name="FINAL CATYA-12-1", part="FINAL CATYA-12"
*End Instance
**
*Instance, name="FINAL CATYA-13-1", part="FINAL CATYA-13"
*End Instance
**
*Instance, name="FINAL CATYA-14-1", part="FINAL CATYA-14"
*End Instance
**
*Instance, name="FINAL CATYA-15-1", part="FINAL CATYA-15"
*End Instance
**
*Instance, name="FINAL CATYA-16-1", part="FINAL CATYA-16"
*End Instance
**
*Instance, name="FINAL CATYA-17-1", part="FINAL CATYA-17"
*End Instance
**
*Instance, name="FINAL CATYA-18-1", part="FINAL CATYA-18"
*End Instance
**
*Instance, name="FINAL CATYA-19-1", part="FINAL CATYA-19"
*End Instance
**
*Instance, name="FINAL CATYA-20-1", part="FINAL CATYA-20"
*End Instance
**
*Instance, name="FINAL CATYA-21-1", part="FINAL CATYA-21"
*End Instance
**
*Instance, name="FINAL CATYA-22-1", part="FINAL CATYA-22"
*End Instance
**
*Instance, name="FINAL CATYA-23-1", part="FINAL CATYA-23"
*End Instance
**
*Instance, name="FINAL CATYA-24-1", part="FINAL CATYA-24"
*End Instance
**
*Instance, name="FINAL CATYA-25-1", part="FINAL CATYA-25"
*End Instance
**
*Instance, name="FINAL CATYA-26-1", part="FINAL CATYA-26"
*End Instance
**
*Instance, name="FINAL CATYA-27-1", part="FINAL CATYA-27"
*End Instance
**
*Instance, name="FINAL CATYA-28-1", part="FINAL CATYA-28"
*End Instance
**
*Instance, name="FINAL CATYA-29-1", part="FINAL CATYA-29"
*End Instance
**
*Instance, name="FINAL CATYA-1-2", part="FINAL CATYA-1"
*End Instance
**
*Instance, name="FINAL CATYA-2-2", part="FINAL CATYA-2"
*End Instance
**
*Instance, name="FINAL CATYA-3-2", part="FINAL CATYA-3"
*End Instance
**
*Instance, name="FINAL CATYA-4-2", part="FINAL CATYA-4"
*End Instance
**
*Instance, name="FINAL CATYA-5-2", part="FINAL CATYA-5"
*End Instance
**
*Instance, name="FINAL CATYA-6-2", part="FINAL CATYA-6"
*End Instance
**
*Instance, name="FINAL CATYA-7-2", part="FINAL CATYA-7"
*End Instance
**
*Instance, name="FINAL CATYA-8-2", part="FINAL CATYA-8"
*End Instance
**
*Instance, name="FINAL CATYA-9-2", part="FINAL CATYA-9"
*End Instance
**
*Instance, name="FINAL CATYA-10-2", part="FINAL CATYA-10"
*End Instance
**
*Instance, name="FINAL CATYA-11-2", part="FINAL CATYA-11"
*End Instance
**
*Instance, name="FINAL CATYA-12-2", part="FINAL CATYA-12"
*End Instance
**
*Instance, name="FINAL CATYA-13-2", part="FINAL CATYA-13"
*End Instance
**
*Instance, name="FINAL CATYA-14-2", part="FINAL CATYA-14"
*End Instance
**
*Instance, name="FINAL CATYA-15-2", part="FINAL CATYA-15"
*End Instance
**
*Instance, name="FINAL CATYA-16-2", part="FINAL CATYA-16"
*End Instance
**
*Instance, name="FINAL CATYA-17-2", part="FINAL CATYA-17"
*End Instance
**
*Instance, name="FINAL CATYA-18-2", part="FINAL CATYA-18"
*End Instance
**
*Instance, name="FINAL CATYA-19-2", part="FINAL CATYA-19"
*End Instance
**
*Instance, name="FINAL CATYA-20-2", part="FINAL CATYA-20"
*End Instance
**
*Instance, name="FINAL CATYA-21-2", part="FINAL CATYA-21"
*End Instance
**
*Instance, name="FINAL CATYA-22-2", part="FINAL CATYA-22"
*End Instance
**
*Instance, name="FINAL CATYA-23-2", part="FINAL CATYA-23"
*End Instance
**
*Instance, name="FINAL CATYA-24-2", part="FINAL CATYA-24"
*End Instance
**
*Instance, name="FINAL CATYA-25-2", part="FINAL CATYA-25"
*End Instance
**
*Instance, name="FINAL CATYA-26-2", part="FINAL CATYA-26"
*End Instance
**
*Instance, name="FINAL CATYA-27-2", part="FINAL CATYA-27"
*End Instance
**
*Instance, name="FINAL CATYA-28-2", part="FINAL CATYA-28"
*End Instance
**
*Instance, name="FINAL CATYA-29-2", part="FINAL CATYA-29"
*End Instance
**
*Instance, name="FINAL CATYA-1-3", part="FINAL CATYA-1"
*End Instance
**
*Instance, name="FINAL CATYA-2-3", part="FINAL CATYA-2"
*End Instance
**
*Instance, name="FINAL CATYA-3-3", part="FINAL CATYA-3"
*End Instance
**
*Instance, name="FINAL CATYA-4-3", part="FINAL CATYA-4"
*End Instance
**
*Instance, name="FINAL CATYA-5-3", part="FINAL CATYA-5"
*End Instance
**
*Instance, name="FINAL CATYA-6-3", part="FINAL CATYA-6"
*End Instance
**
*Instance, name="FINAL CATYA-7-3", part="FINAL CATYA-7"
*End Instance
**
*Instance, name="FINAL CATYA-8-3", part="FINAL CATYA-8"
*End Instance
**
*Instance, name="FINAL CATYA-9-3", part="FINAL CATYA-9"
*End Instance
**
*Instance, name="FINAL CATYA-10-3", part="FINAL CATYA-10"
*End Instance
**
*Instance, name="FINAL CATYA-11-3", part="FINAL CATYA-11"
*End Instance
**
*Instance, name="FINAL CATYA-12-3", part="FINAL CATYA-12"
*End Instance
**
*Instance, name="FINAL CATYA-13-3", part="FINAL CATYA-13"
*End Instance
**
*Instance, name="FINAL CATYA-14-3", part="FINAL CATYA-14"
*End Instance
**
*Instance, name="FINAL CATYA-15-3", part="FINAL CATYA-15"
*End Instance
**
*Instance, name="FINAL CATYA-16-3", part="FINAL CATYA-16"
*End Instance
**
*Instance, name="FINAL CATYA-17-3", part="FINAL CATYA-17"
*End Instance
**
*Instance, name="FINAL CATYA-18-3", part="FINAL CATYA-18"
*End Instance
**
*Instance, name="FINAL CATYA-19-3", part="FINAL CATYA-19"
*End Instance
**
*Instance, name="FINAL CATYA-20-3", part="FINAL CATYA-20"
*End Instance
**
*Instance, name="FINAL CATYA-21-3", part="FINAL CATYA-21"
*End Instance
**
*Instance, name="FINAL CATYA-22-3", part="FINAL CATYA-22"
*End Instance
**
*Instance, name="FINAL CATYA-23-3", part="FINAL CATYA-23"
*End Instance
**
*Instance, name="FINAL CATYA-24-3", part="FINAL CATYA-24"
*End Instance
**
*Instance, name="FINAL CATYA-25-3", part="FINAL CATYA-25"
*End Instance
**
*Instance, name="FINAL CATYA-26-3", part="FINAL CATYA-26"
*End Instance
**
*Instance, name="FINAL CATYA-27-3", part="FINAL CATYA-27"
*End Instance
**
*Instance, name="FINAL CATYA-28-3", part="FINAL CATYA-28"
*End Instance
**
*Instance, name="FINAL CATYA-29-3", part="FINAL CATYA-29"
*End Instance
**
*Node
*Nset, nset=Set-2
*Nset, nset=Set-3, instance="FINAL CATYA-16-1", generate
*Nset, nset=Set-3, instance="FINAL CATYA-18-1", generate
*Nset, nset=Set-3, instance="FINAL CATYA-19-1", generate
*Elset, elset=Set-3, instance="FINAL CATYA-16-1", generate
*Elset, elset=Set-3, instance="FINAL CATYA-18-1", generate
*Elset, elset=Set-3, instance="FINAL CATYA-19-1", generate
*Nset, nset=m_Set-1
*Elset, elset=_m_Surf-2_S6, internal, instance="FINAL CATYA-16-1", generate
*Surface, type=ELEMENT, name=m_Surf-2
_m_Surf-2_S6, S6
*Elset, elset=_m_Surf-4_S3, internal, instance="FINAL CATYA-1-1"
*Elset, elset=_m_Surf-4_S4, internal, instance="FINAL CATYA-1-1"
*Elset, elset=_m_Surf-4_S2, internal, instance="FINAL CATYA-1-1"
*Elset, elset=_m_Surf-4_S1, internal, instance="FINAL CATYA-1-1"
*Surface, type=ELEMENT, name=m_Surf-4
_m_Surf-4_S3, S3
_m_Surf-4_S4, S4
_m_Surf-4_S2, S2
_m_Surf-4_S1, S1
*Elset, elset=_m_Surf-6_S3, internal, instance="FINAL CATYA-2-1"
*Elset, elset=_m_Surf-6_S1, internal, instance="FINAL CATYA-2-1"
*Elset, elset=_m_Surf-6_S4, internal, instance="FINAL CATYA-2-1"
*Elset, elset=_m_Surf-6_S2, internal, instance="FINAL CATYA-2-1"
*Surface, type=ELEMENT, name=m_Surf-6
_m_Surf-6_S3, S3
_m_Surf-6_S1, S1
_m_Surf-6_S4, S4
_m_Surf-6_S2, S2
*Elset, elset=_m_Surf-8_S3, internal, instance="FINAL CATYA-1-1"
*Elset, elset=_m_Surf-8_S4, internal, instance="FINAL CATYA-1-1"
*Elset, elset=_m_Surf-8_S2, internal, instance="FINAL CATYA-1-1"
*Elset, elset=_m_Surf-8_S1, internal, instance="FINAL CATYA-1-1"
*Surface, type=ELEMENT, name=m_Surf-8
_m_Surf-8_S3, S3
_m_Surf-8_S4, S4
_m_Surf-8_S2, S2
_m_Surf-8_S1, S1
*Elset, elset=_m_Surf-10_S1, internal, instance="FINAL CATYA-3-1"
*Elset, elset=_m_Surf-10_S3, internal, instance="FINAL CATYA-3-1"
*Elset, elset=_m_Surf-10_S4, internal, instance="FINAL CATYA-3-1"
*Elset, elset=_m_Surf-10_S2, internal, instance="FINAL CATYA-3-1"
*Surface, type=ELEMENT, name=m_Surf-10
_m_Surf-10_S1, S1
_m_Surf-10_S3, S3
_m_Surf-10_S4, S4
_m_Surf-10_S2, S2
*Elset, elset=_m_Surf-12_S1, internal, instance="FINAL CATYA-20-1"
*Elset, elset=_m_Surf-12_S2, internal, instance="FINAL CATYA-20-1"
*Elset, elset=_m_Surf-12_S3, internal, instance="FINAL CATYA-20-1"
*Surface, type=ELEMENT, name=m_Surf-12
_m_Surf-12_S1, S1
_m_Surf-12_S2, S2
_m_Surf-12_S3, S3
*Elset, elset=_m_Surf-14_S3, internal, instance="FINAL CATYA-24-1"
*Elset, elset=_m_Surf-14_S2, internal, instance="FINAL CATYA-24-1"
*Surface, type=ELEMENT, name=m_Surf-14
_m_Surf-14_S3, S3
_m_Surf-14_S2, S2
*Elset, elset=_m_Surf-16_S4, internal, instance="FINAL CATYA-15-1"
*Elset, elset=_m_Surf-16_S3, internal, instance="FINAL CATYA-15-1"
*Elset, elset=_m_Surf-16_S1, internal, instance="FINAL CATYA-15-1"
*Elset, elset=_m_Surf-16_S2, internal, instance="FINAL CATYA-15-1"
*Surface, type=ELEMENT, name=m_Surf-16
_m_Surf-16_S4, S4
_m_Surf-16_S3, S3
_m_Surf-16_S2, S2
_m_Surf-16_S1, S1
*Elset, elset=_m_Surf-18_S3, internal, instance="FINAL CATYA-13-1"
*Elset, elset=_m_Surf-18_S4, internal, instance="FINAL CATYA-13-1"
*Elset, elset=_m_Surf-18_S1, internal, instance="FINAL CATYA-13-1"
*Elset, elset=_m_Surf-18_S2, internal, instance="FINAL CATYA-13-1"
*Surface, type=ELEMENT, name=m_Surf-18
_m_Surf-18_S3, S3
_m_Surf-18_S4, S4
_m_Surf-18_S2, S2
_m_Surf-18_S1, S1
*Elset, elset=_m_Surf-20_S3, internal, instance="FINAL CATYA-15-1"
*Elset, elset=_m_Surf-20_S4, internal, instance="FINAL CATYA-15-1"
*Surface, type=ELEMENT, name=m_Surf-20
_m_Surf-20_S3, S3
_m_Surf-20_S4, S4
*Elset, elset=_m_Surf-22_S3, internal, instance="FINAL CATYA-13-1"
*Surface, type=ELEMENT, name=m_Surf-22
_m_Surf-22_S3, S3
*Elset, elset=_m_Surf-24_S6, internal, instance="FINAL CATYA-19-1", generate
*Surface, type=ELEMENT, name=m_Surf-24
_m_Surf-24_S6, S6
*Elset, elset=_m_Surf-26_S3, internal, instance="FINAL CATYA-7-1"
*Elset, elset=_m_Surf-26_S2, internal, instance="FINAL CATYA-7-1"
*Elset, elset=_m_Surf-26_S1, internal, instance="FINAL CATYA-7-1"
*Elset, elset=_m_Surf-26_S4, internal, instance="FINAL CATYA-7-1"
*Surface, type=ELEMENT, name=m_Surf-26
_m_Surf-26_S3, S3
_m_Surf-26_S2, S2
_m_Surf-26_S4, S4
_m_Surf-26_S1, S1
*Elset, elset=_m_Surf-28_S3, internal, instance="FINAL CATYA-7-1"
*Elset, elset=_m_Surf-28_S2, internal, instance="FINAL CATYA-7-1"
*Elset, elset=_m_Surf-28_S1, internal, instance="FINAL CATYA-7-1"
*Elset, elset=_m_Surf-28_S4, internal, instance="FINAL CATYA-7-1"
*Surface, type=ELEMENT, name=m_Surf-28
_m_Surf-28_S3, S3
_m_Surf-28_S2, S2
_m_Surf-28_S4, S4
_m_Surf-28_S1, S1
*Elset, elset=_m_Surf-30_S3, internal, instance="FINAL CATYA-8-1"
*Elset, elset=_m_Surf-30_S4, internal, instance="FINAL CATYA-8-1"
*Elset, elset=_m_Surf-30_S1, internal, instance="FINAL CATYA-8-1"
*Elset, elset=_m_Surf-30_S2, internal, instance="FINAL CATYA-8-1"
*Surface, type=ELEMENT, name=m_Surf-30
_m_Surf-30_S3, S3
_m_Surf-30_S4, S4
_m_Surf-30_S2, S2
_m_Surf-30_S1, S1
*Elset, elset=_m_Surf-32_S3, internal, instance="FINAL CATYA-9-1"
*Elset, elset=_m_Surf-32_S2, internal, instance="FINAL CATYA-9-1"
*Elset, elset=_m_Surf-32_S4, internal, instance="FINAL CATYA-9-1"
*Surface, type=ELEMENT, name=m_Surf-32
_m_Surf-32_S3, S3
_m_Surf-32_S2, S2
_m_Surf-32_S4, S4
*Elset, elset=_m_Surf-34_S4, internal, instance="FINAL CATYA-21-1"
*Elset, elset=_m_Surf-34_S2, internal, instance="FINAL CATYA-21-1"
*Elset, elset=_m_Surf-34_S1, internal, instance="FINAL CATYA-21-1"
*Elset, elset=_m_Surf-34_S3, internal, instance="FINAL CATYA-21-1"
*Surface, type=ELEMENT, name=m_Surf-34
_m_Surf-34_S4, S4
_m_Surf-34_S2, S2
_m_Surf-34_S1, S1
_m_Surf-34_S3, S3
*Elset, elset=_m_Surf-36_S3, internal, instance="FINAL CATYA-12-1"
*Elset, elset=_m_Surf-36_S1, internal, instance="FINAL CATYA-12-1"
*Elset, elset=_m_Surf-36_S4, internal, instance="FINAL CATYA-12-1"
*Elset, elset=_m_Surf-36_S2, internal, instance="FINAL CATYA-12-1"
*Surface, type=ELEMENT, name=m_Surf-36
_m_Surf-36_S3, S3
_m_Surf-36_S1, S1
_m_Surf-36_S4, S4
_m_Surf-36_S2, S2
*Elset, elset=_m_Surf-38_S4, internal, instance="FINAL CATYA-12-1"
*Elset, elset=_m_Surf-38_S3, internal, instance="FINAL CATYA-12-1"
*Elset, elset=_m_Surf-38_S1, internal, instance="FINAL CATYA-12-1"
*Elset, elset=_m_Surf-38_S2, internal, instance="FINAL CATYA-12-1"
*Surface, type=ELEMENT, name=m_Surf-38
_m_Surf-38_S4, S4
_m_Surf-38_S3, S3
_m_Surf-38_S2, S2
_m_Surf-38_S1, S1
*Elset, elset=_m_Surf-40_S3, internal, instance="FINAL CATYA-27-1"
*Elset, elset=_m_Surf-40_S4, internal, instance="FINAL CATYA-27-1"
*Elset, elset=_m_Surf-40_S2, internal, instance="FINAL CATYA-27-1"
*Elset, elset=_m_Surf-40_S1, internal, instance="FINAL CATYA-27-1"
*Surface, type=ELEMENT, name=m_Surf-40
_m_Surf-40_S3, S3
_m_Surf-40_S4, S4
_m_Surf-40_S2, S2
_m_Surf-40_S1, S1
*Elset, elset=_m_Surf-42_S3, internal, instance="FINAL CATYA-29-1"
*Surface, type=ELEMENT, name=m_Surf-42
_m_Surf-42_S3, S3
*Elset, elset=_m_Surf-44_S3, internal, instance="FINAL CATYA-28-1"
*Surface, type=ELEMENT, name=m_Surf-44
_m_Surf-44_S3, S3
*Elset, elset=_m_Surf-46_S6, internal, instance="FINAL CATYA-18-1", generate
*Surface, type=ELEMENT, name=m_Surf-46
_m_Surf-46_S6, S6
*Elset, elset=_m_Surf-48_S1, internal, instance="FINAL CATYA-4-1"
*Elset, elset=_m_Surf-48_S4, internal, instance="FINAL CATYA-4-1"
*Elset, elset=_m_Surf-48_S3, internal, instance="FINAL CATYA-4-1"
*Elset, elset=_m_Surf-48_S2, internal, instance="FINAL CATYA-4-1"
*Surface, type=ELEMENT, name=m_Surf-48
_m_Surf-48_S1, S1
_m_Surf-48_S4, S4
_m_Surf-48_S2, S2
_m_Surf-48_S3, S3
*Elset, elset=_m_Surf-50_S1, internal, instance="FINAL CATYA-4-1"
*Elset, elset=_m_Surf-50_S4, internal, instance="FINAL CATYA-4-1"
*Elset, elset=_m_Surf-50_S3, internal, instance="FINAL CATYA-4-1"
*Elset, elset=_m_Surf-50_S2, internal, instance="FINAL CATYA-4-1"
*Surface, type=ELEMENT, name=m_Surf-50
_m_Surf-50_S1, S1
_m_Surf-50_S4, S4
_m_Surf-50_S2, S2
_m_Surf-50_S3, S3
*Elset, elset=_m_Surf-52_S3, internal, instance="FINAL CATYA-6-1"
*Elset, elset=_m_Surf-52_S1, internal, instance="FINAL CATYA-6-1"
*Elset, elset=_m_Surf-52_S2, internal, instance="FINAL CATYA-6-1"
*Elset, elset=_m_Surf-52_S4, internal, instance="FINAL CATYA-6-1"
*Surface, type=ELEMENT, name=m_Surf-52
_m_Surf-52_S3, S3
_m_Surf-52_S1, S1
_m_Surf-52_S2, S2
_m_Surf-52_S4, S4
*Elset, elset=_m_Surf-54_S4, internal, instance="FINAL CATYA-5-1"
*Elset, elset=_m_Surf-54_S3, internal, instance="FINAL CATYA-5-1"
*Elset, elset=_m_Surf-54_S1, internal, instance="FINAL CATYA-5-1"
*Elset, elset=_m_Surf-54_S2, internal, instance="FINAL CATYA-5-1"
*Surface, type=ELEMENT, name=m_Surf-54
_m_Surf-54_S4, S4
_m_Surf-54_S3, S3
_m_Surf-54_S2, S2
_m_Surf-54_S1, S1
*Elset, elset=_m_Surf-56_S2, internal, instance="FINAL CATYA-22-1"
*Elset, elset=_m_Surf-56_S4, internal, instance="FINAL CATYA-22-1"
*Elset, elset=_m_Surf-56_S3, internal, instance="FINAL CATYA-22-1"
*Elset, elset=_m_Surf-56_S1, internal, instance="FINAL CATYA-22-1"
*Surface, type=ELEMENT, name=m_Surf-56
_m_Surf-56_S2, S2
_m_Surf-56_S4, S4
_m_Surf-56_S3, S3
_m_Surf-56_S1, S1
*Elset, elset=_m_Surf-58_S1, internal, instance="FINAL CATYA-11-1"
*Elset, elset=_m_Surf-58_S3, internal, instance="FINAL CATYA-11-1"
*Elset, elset=_m_Surf-58_S4, internal, instance="FINAL CATYA-11-1"
*Elset, elset=_m_Surf-58_S2, internal, instance="FINAL CATYA-11-1"
*Surface, type=ELEMENT, name=m_Surf-58
_m_Surf-58_S1, S1
_m_Surf-58_S3, S3
_m_Surf-58_S4, S4
_m_Surf-58_S2, S2
*Elset, elset=_m_Surf-60_S3, internal, instance="FINAL CATYA-11-1"
*Elset, elset=_m_Surf-60_S4, internal, instance="FINAL CATYA-11-1"
*Elset, elset=_m_Surf-60_S1, internal, instance="FINAL CATYA-11-1"
*Elset, elset=_m_Surf-60_S2, internal, instance="FINAL CATYA-11-1"
*Surface, type=ELEMENT, name=m_Surf-60
_m_Surf-60_S3, S3
_m_Surf-60_S4, S4
_m_Surf-60_S2, S2
_m_Surf-60_S1, S1
*Elset, elset=_m_Surf-62_S4, internal, instance="FINAL CATYA-25-1"
*Elset, elset=_m_Surf-62_S3, internal, instance="FINAL CATYA-25-1"
*Elset, elset=_m_Surf-62_S2, internal, instance="FINAL CATYA-25-1"
*Surface, type=ELEMENT, name=m_Surf-62
_m_Surf-62_S4, S4
_m_Surf-62_S3, S3
_m_Surf-62_S2, S2
*Elset, elset=_m_Surf-64_S4, internal, instance="FINAL CATYA-25-1"
*Elset, elset=_m_Surf-64_S3, internal, instance="FINAL CATYA-25-1"
*Elset, elset=_m_Surf-64_S2, internal, instance="FINAL CATYA-25-1"
*Surface, type=ELEMENT, name=m_Surf-64
_m_Surf-64_S4, S4
_m_Surf-64_S3, S3
_m_Surf-64_S2, S2
*Elset, elset=_m_Surf-66_S3, internal, instance="FINAL CATYA-26-1"
*Elset, elset=_m_Surf-66_S2, internal, instance="FINAL CATYA-26-1"
*Surface, type=ELEMENT, name=m_Surf-66
_m_Surf-66_S3, S3
_m_Surf-66_S2, S2
*Elset, elset=_m_Surf-68_S4, internal, instance="FINAL CATYA-15-1"
*Elset, elset=_m_Surf-68_S3, internal, instance="FINAL CATYA-15-1"
*Elset, elset=_m_Surf-68_S1, internal, instance="FINAL CATYA-15-1"
*Elset, elset=_m_Surf-68_S2, internal, instance="FINAL CATYA-15-1"
*Surface, type=ELEMENT, name=m_Surf-68
_m_Surf-68_S4, S4
_m_Surf-68_S3, S3
_m_Surf-68_S2, S2
_m_Surf-68_S1, S1
*Elset, elset=_s_Surf-1_S3, internal, instance="FINAL CATYA-10-1"
*Elset, elset=_s_Surf-1_S4, internal, instance="FINAL CATYA-10-1"
*Elset, elset=_s_Surf-1_S2, internal, instance="FINAL CATYA-10-1"
*Elset, elset=_s_Surf-1_S1, internal, instance="FINAL CATYA-10-1"
*Surface, type=ELEMENT, name=s_Surf-1
_s_Surf-1_S3, S3
_s_Surf-1_S4, S4
_s_Surf-1_S2, S2
_s_Surf-1_S1, S1
*Elset, elset=_s_Surf-2_S3, internal, instance="FINAL CATYA-1-1"
*Elset, elset=_s_Surf-2_S2, internal, instance="FINAL CATYA-1-1"
*Elset, elset=_s_Surf-2_S4, internal, instance="FINAL CATYA-1-1"
*Elset, elset=_s_Surf-2_S1, internal, instance="FINAL CATYA-1-1"
*Surface, type=ELEMENT, name=s_Surf-2
_s_Surf-2_S3, S3
_s_Surf-2_S2, S2
_s_Surf-2_S4, S4
_s_Surf-2_S1, S1
*Elset, elset=_s_Surf-4_S3, internal, instance="FINAL CATYA-2-1"
*Elset, elset=_s_Surf-4_S2, internal, instance="FINAL CATYA-2-1"
*Elset, elset=_s_Surf-4_S1, internal, instance="FINAL CATYA-2-1"
*Surface, type=ELEMENT, name=s_Surf-4
_s_Surf-4_S3, S3
_s_Surf-4_S2, S2
_s_Surf-4_S1, S1
*Elset, elset=_s_Surf-6_S4, internal, instance="FINAL CATYA-20-1"
*Elset, elset=_s_Surf-6_S3, internal, instance="FINAL CATYA-20-1"
*Elset, elset=_s_Surf-6_S2, internal, instance="FINAL CATYA-20-1"
*Elset, elset=_s_Surf-6_S1, internal, instance="FINAL CATYA-20-1"
*Surface, type=ELEMENT, name=s_Surf-6
_s_Surf-6_S4, S4
_s_Surf-6_S3, S3
_s_Surf-6_S2, S2
_s_Surf-6_S1, S1
*Elset, elset=_s_Surf-8_S3, internal, instance="FINAL CATYA-3-1"
*Elset, elset=_s_Surf-8_S1, internal, instance="FINAL CATYA-3-1"
*Elset, elset=_s_Surf-8_S4, internal, instance="FINAL CATYA-3-1"
*Surface, type=ELEMENT, name=s_Surf-8
_s_Surf-8_S3, S3
_s_Surf-8_S1, S1
_s_Surf-8_S4, S4
*Elset, elset=_s_Surf-10_S3, internal, instance="FINAL CATYA-20-1"
*Elset, elset=_s_Surf-10_S4, internal, instance="FINAL CATYA-20-1"
*Elset, elset=_s_Surf-10_S1, internal, instance="FINAL CATYA-20-1"
*Elset, elset=_s_Surf-10_S2, internal, instance="FINAL CATYA-20-1"
*Surface, type=ELEMENT, name=s_Surf-10
_s_Surf-10_S3, S3
_s_Surf-10_S4, S4
_s_Surf-10_S2, S2
_s_Surf-10_S1, S1
*Elset, elset=_s_Surf-12_S3, internal, instance="FINAL CATYA-24-1"
*Elset, elset=_s_Surf-12_S1, internal, instance="FINAL CATYA-24-1"
*Elset, elset=_s_Surf-12_S4, internal, instance="FINAL CATYA-24-1"
*Elset, elset=_s_Surf-12_S2, internal, instance="FINAL CATYA-24-1", generate
*Surface, type=ELEMENT, name=s_Surf-12
_s_Surf-12_S3, S3
_s_Surf-12_S1, S1
_s_Surf-12_S4, S4
_s_Surf-12_S2, S2
*Elset, elset=_s_Surf-14_S2, internal, instance="FINAL CATYA-23-1"
*Elset, elset=_s_Surf-14_S3, internal, instance="FINAL CATYA-23-1"
*Elset, elset=_s_Surf-14_S1, internal, instance="FINAL CATYA-23-1"
*Elset, elset=_s_Surf-14_S4, internal, instance="FINAL CATYA-23-1"
*Surface, type=ELEMENT, name=s_Surf-14
_s_Surf-14_S2, S2
_s_Surf-14_S3, S3
_s_Surf-14_S4, S4
_s_Surf-14_S1, S1
*Elset, elset=_s_Surf-16_S4, internal, instance="FINAL CATYA-15-1"
*Elset, elset=_s_Surf-16_S3, internal, instance="FINAL CATYA-15-1"
*Elset, elset=_s_Surf-16_S1, internal, instance="FINAL CATYA-15-1"
*Elset, elset=_s_Surf-16_S2, internal, instance="FINAL CATYA-15-1"
*Surface, type=ELEMENT, name=s_Surf-16
_s_Surf-16_S4, S4
_s_Surf-16_S3, S3
_s_Surf-16_S2, S2
_s_Surf-16_S1, S1
*Elset, elset=_s_Surf-18_S2, internal, instance="FINAL CATYA-10-1"
*Elset, elset=_s_Surf-18_S3, internal, instance="FINAL CATYA-10-1"
*Elset, elset=_s_Surf-18_S1, internal, instance="FINAL CATYA-10-1"
*Elset, elset=_s_Surf-18_S4, internal, instance="FINAL CATYA-10-1"
*Surface, type=ELEMENT, name=s_Surf-18
_s_Surf-18_S2, S2
_s_Surf-18_S3, S3
_s_Surf-18_S4, S4
_s_Surf-18_S1, S1
*Elset, elset=_s_Surf-20_S3, internal, instance="FINAL CATYA-23-1"
*Elset, elset=_s_Surf-20_S4, internal, instance="FINAL CATYA-23-1"
*Elset, elset=_s_Surf-20_S1, internal, instance="FINAL CATYA-23-1"
*Elset, elset=_s_Surf-20_S2, internal, instance="FINAL CATYA-23-1"
*Surface, type=ELEMENT, name=s_Surf-20
_s_Surf-20_S3, S3
_s_Surf-20_S4, S4
_s_Surf-20_S2, S2
_s_Surf-20_S1, S1
*Elset, elset=_s_Surf-22_S3, internal, instance="FINAL CATYA-23-1"
*Elset, elset=_s_Surf-22_S4, internal, instance="FINAL CATYA-23-1"
*Elset, elset=_s_Surf-22_S1, internal, instance="FINAL CATYA-23-1"
*Elset, elset=_s_Surf-22_S2, internal, instance="FINAL CATYA-23-1"
*Surface, type=ELEMENT, name=s_Surf-22
_s_Surf-22_S3, S3
_s_Surf-22_S4, S4
_s_Surf-22_S2, S2
_s_Surf-22_S1, S1
*Elset, elset=_s_Surf-24_S4, internal, instance="FINAL CATYA-7-1"
*Elset, elset=_s_Surf-24_S3, internal, instance="FINAL CATYA-7-1"
*Elset, elset=_s_Surf-24_S1, internal, instance="FINAL CATYA-7-1"
*Elset, elset=_s_Surf-24_S2, internal, instance="FINAL CATYA-7-1"
*Surface, type=ELEMENT, name=s_Surf-24
_s_Surf-24_S4, S4
_s_Surf-24_S3, S3
_s_Surf-24_S2, S2
_s_Surf-24_S1, S1
*Elset, elset=_s_Surf-26_S3, internal, instance="FINAL CATYA-8-1"
*Surface, type=ELEMENT, name=s_Surf-26
_s_Surf-26_S3, S3
*Elset, elset=_s_Surf-28_S3, internal, instance="FINAL CATYA-9-1"
*Elset, elset=_s_Surf-28_S1, internal, instance="FINAL CATYA-9-1"
*Surface, type=ELEMENT, name=s_Surf-28
_s_Surf-28_S3, S3
_s_Surf-28_S1, S1
*Elset, elset=_s_Surf-30_S2, internal, instance="FINAL CATYA-21-1"
*Elset, elset=_s_Surf-30_S3, internal, instance="FINAL CATYA-21-1"
*Elset, elset=_s_Surf-30_S1, internal, instance="FINAL CATYA-21-1"
*Elset, elset=_s_Surf-30_S4, internal, instance="FINAL CATYA-21-1"
*Surface, type=ELEMENT, name=s_Surf-30
_s_Surf-30_S2, S2
_s_Surf-30_S3, S3
_s_Surf-30_S4, S4
_s_Surf-30_S1, S1
*Elset, elset=_s_Surf-32_S1, internal, instance="FINAL CATYA-21-1"
*Elset, elset=_s_Surf-32_S4, internal, instance="FINAL CATYA-21-1"
*Elset, elset=_s_Surf-32_S2, internal, instance="FINAL CATYA-21-1"
*Elset, elset=_s_Surf-32_S3, internal, instance="FINAL CATYA-21-1"
*Surface, type=ELEMENT, name=s_Surf-32
_s_Surf-32_S1, S1
_s_Surf-32_S4, S4
_s_Surf-32_S2, S2
_s_Surf-32_S3, S3
*Elset, elset=_s_Surf-34_S3, internal, instance="FINAL CATYA-28-1"
*Surface, type=ELEMENT, name=s_Surf-34
_s_Surf-34_S3, S3
*Elset, elset=_s_Surf-36_S2, internal, instance="FINAL CATYA-10-1"
*Elset, elset=_s_Surf-36_S3, internal, instance="FINAL CATYA-10-1"
*Elset, elset=_s_Surf-36_S1, internal, instance="FINAL CATYA-10-1"
*Elset, elset=_s_Surf-36_S4, internal, instance="FINAL CATYA-10-1"
*Surface, type=ELEMENT, name=s_Surf-36
_s_Surf-36_S2, S2
_s_Surf-36_S3, S3
_s_Surf-36_S4, S4
_s_Surf-36_S1, S1
*Elset, elset=_s_Surf-38_S3, internal, instance="FINAL CATYA-29-1"
*Elset, elset=_s_Surf-38_S4, internal, instance="FINAL CATYA-29-1"
*Elset, elset=_s_Surf-38_S2, internal, instance="FINAL CATYA-29-1"
*Elset, elset=_s_Surf-38_S1, internal, instance="FINAL CATYA-29-1"
*Surface, type=ELEMENT, name=s_Surf-38
_s_Surf-38_S3, S3
_s_Surf-38_S4, S4
_s_Surf-38_S2, S2
_s_Surf-38_S1, S1
*Elset, elset=_s_Surf-40_S3, internal, instance="FINAL CATYA-12-1"
*Surface, type=ELEMENT, name=s_Surf-40
_s_Surf-40_S3, S3
*Elset, elset=_s_Surf-42_S3, internal, instance="FINAL CATYA-27-1"
*Elset, elset=_s_Surf-42_S4, internal, instance="FINAL CATYA-27-1"
*Elset, elset=_s_Surf-42_S2, internal, instance="FINAL CATYA-27-1"
*Elset, elset=_s_Surf-42_S1, internal, instance="FINAL CATYA-27-1"
*Surface, type=ELEMENT, name=s_Surf-42
_s_Surf-42_S3, S3
_s_Surf-42_S4, S4
_s_Surf-42_S2, S2
_s_Surf-42_S1, S1
*Elset, elset=_s_Surf-44_S3, internal, instance="FINAL CATYA-27-1"
*Elset, elset=_s_Surf-44_S1, internal, instance="FINAL CATYA-27-1"
*Elset, elset=_s_Surf-44_S2, internal, instance="FINAL CATYA-27-1"
*Elset, elset=_s_Surf-44_S4, internal, instance="FINAL CATYA-27-1"
*Surface, type=ELEMENT, name=s_Surf-44
_s_Surf-44_S3, S3
_s_Surf-44_S1, S1
_s_Surf-44_S2, S2
_s_Surf-44_S4, S4
*Elset, elset=_s_Surf-46_S3, internal, instance="FINAL CATYA-4-1"
*Elset, elset=_s_Surf-46_S4, internal, instance="FINAL CATYA-4-1"
*Elset, elset=_s_Surf-46_S1, internal, instance="FINAL CATYA-4-1"
*Elset, elset=_s_Surf-46_S2, internal, instance="FINAL CATYA-4-1"
*Surface, type=ELEMENT, name=s_Surf-46
_s_Surf-46_S3, S3
_s_Surf-46_S4, S4
_s_Surf-46_S2, S2
_s_Surf-46_S1, S1
*Elset, elset=_s_Surf-48_S3, internal, instance="FINAL CATYA-6-1"
*Elset, elset=_s_Surf-48_S1, internal, instance="FINAL CATYA-6-1"
*Elset, elset=_s_Surf-48_S2, internal, instance="FINAL CATYA-6-1"
*Surface, type=ELEMENT, name=s_Surf-48
_s_Surf-48_S3, S3
_s_Surf-48_S1, S1
_s_Surf-48_S2, S2
*Elset, elset=_s_Surf-50_S3, internal, instance="FINAL CATYA-5-1"
*Elset, elset=_s_Surf-50_S1, internal, instance="FINAL CATYA-5-1"
*Elset, elset=_s_Surf-50_S4, internal, instance="FINAL CATYA-5-1"
*Surface, type=ELEMENT, name=s_Surf-50
_s_Surf-50_S3, S3
_s_Surf-50_S1, S1
_s_Surf-50_S4, S4
*Elset, elset=_s_Surf-52_S1, internal, instance="FINAL CATYA-22-1"
*Elset, elset=_s_Surf-52_S4, internal, instance="FINAL CATYA-22-1"
*Elset, elset=_s_Surf-52_S2, internal, instance="FINAL CATYA-22-1"
*Elset, elset=_s_Surf-52_S3, internal, instance="FINAL CATYA-22-1"
*Surface, type=ELEMENT, name=s_Surf-52
_s_Surf-52_S1, S1
_s_Surf-52_S4, S4
_s_Surf-52_S2, S2
_s_Surf-52_S3, S3
*Elset, elset=_s_Surf-54_S2, internal, instance="FINAL CATYA-22-1"
*Elset, elset=_s_Surf-54_S1, internal, instance="FINAL CATYA-22-1"
*Elset, elset=_s_Surf-54_S3, internal, instance="FINAL CATYA-22-1"
*Elset, elset=_s_Surf-54_S4, internal, instance="FINAL CATYA-22-1"
*Surface, type=ELEMENT, name=s_Surf-54
_s_Surf-54_S2, S2
_s_Surf-54_S1, S1
_s_Surf-54_S4, S4
_s_Surf-54_S3, S3
*Elset, elset=_s_Surf-56_S4, internal, instance="FINAL CATYA-26-1"
*Elset, elset=_s_Surf-56_S3, internal, instance="FINAL CATYA-26-1"
*Elset, elset=_s_Surf-56_S1, internal, instance="FINAL CATYA-26-1"
*Elset, elset=_s_Surf-56_S2, internal, instance="FINAL CATYA-26-1"
*Surface, type=ELEMENT, name=s_Surf-56
_s_Surf-56_S4, S4
_s_Surf-56_S3, S3
_s_Surf-56_S2, S2
_s_Surf-56_S1, S1
*Elset, elset=_s_Surf-58_S2, internal, instance="FINAL CATYA-10-1"
*Elset, elset=_s_Surf-58_S3, internal, instance="FINAL CATYA-10-1"
*Elset, elset=_s_Surf-58_S1, internal, instance="FINAL CATYA-10-1"
*Elset, elset=_s_Surf-58_S4, internal, instance="FINAL CATYA-10-1"
*Surface, type=ELEMENT, name=s_Surf-58
_s_Surf-58_S2, S2
_s_Surf-58_S3, S3
_s_Surf-58_S4, S4
_s_Surf-58_S1, S1
*Elset, elset=_s_Surf-60_S1, internal, instance="FINAL CATYA-14-1"
*Elset, elset=_s_Surf-60_S3, internal, instance="FINAL CATYA-14-1"
*Elset, elset=_s_Surf-60_S4, internal, instance="FINAL CATYA-14-1"
*Elset, elset=_s_Surf-60_S2, internal, instance="FINAL CATYA-14-1"
*Surface, type=ELEMENT, name=s_Surf-60
_s_Surf-60_S1, S1
_s_Surf-60_S3, S3
_s_Surf-60_S4, S4
_s_Surf-60_S2, S2
*Elset, elset=_s_Surf-62_S3, internal, instance="FINAL CATYA-14-1"
*Surface, type=ELEMENT, name=s_Surf-62
_s_Surf-62_S3, S3
*Elset, elset=_s_Surf-64_S3, internal, instance="FINAL CATYA-11-1"
*Elset, elset=_s_Surf-64_S2, internal, instance="FINAL CATYA-11-1"
*Elset, elset=_s_Surf-64_S4, internal, instance="FINAL CATYA-11-1"
*Surface, type=ELEMENT, name=s_Surf-64
_s_Surf-64_S3, S3
_s_Surf-64_S2, S2
_s_Surf-64_S4, S4
*Elset, elset=_s_Surf-66_S3, internal, instance="FINAL CATYA-25-1"
*Elset, elset=_s_Surf-66_S1, internal, instance="FINAL CATYA-25-1"
*Elset, elset=_s_Surf-66_S2, internal, instance="FINAL CATYA-25-1"
*Elset, elset=_s_Surf-66_S4, internal, instance="FINAL CATYA-25-1"
*Surface, type=ELEMENT, name=s_Surf-66
_s_Surf-66_S3, S3
_s_Surf-66_S1, S1
_s_Surf-66_S2, S2
_s_Surf-66_S4, S4
*Elset, elset=_s_Surf-68_S4, internal, instance="FINAL CATYA-13-1"
*Elset, elset=_s_Surf-68_S3, internal, instance="FINAL CATYA-13-1"
*Elset, elset=_s_Surf-68_S1, internal, instance="FINAL CATYA-13-1"
*Elset, elset=_s_Surf-68_S2, internal, instance="FINAL CATYA-13-1"
*Surface, type=ELEMENT, name=s_Surf-68
_s_Surf-68_S4, S4
_s_Surf-68_S3, S3
_s_Surf-68_S2, S2
_s_Surf-68_S1, S1
** Constraint: Constraint-1
*Coupling, constraint name=Constraint-1, ref node=m_Set-1, surface=s_Surf-1
*Kinematic
** Constraint: Constraint-2
*Tie, name=Constraint-2, adjust=yes
s_Surf-2, m_Surf-2
** Constraint: Constraint-3
*Tie, name=Constraint-3, adjust=yes
s_Surf-4, m_Surf-4
** Constraint: Constraint-4
*Tie, name=Constraint-4, adjust=yes
s_Surf-6, m_Surf-6
** Constraint: Constraint-5
*Tie, name=Constraint-5, adjust=yes
s_Surf-8, m_Surf-8
** Constraint: Constraint-6
*Tie, name=Constraint-6, adjust=yes
s_Surf-10, m_Surf-10
** Constraint: Constraint-7
*Tie, name=Constraint-7, adjust=yes
s_Surf-12, m_Surf-12
** Constraint: Constraint-8
*Tie, name=Constraint-8, adjust=yes
s_Surf-14, m_Surf-14
** Constraint: Constraint-10
*Tie, name=Constraint-10, adjust=yes
s_Surf-18, m_Surf-18
** Constraint: Constraint-11
*Tie, name=Constraint-11, adjust=yes
s_Surf-20, m_Surf-20
** Constraint: Constraint-12
*Tie, name=Constraint-12, adjust=yes
s_Surf-22, m_Surf-22
** Constraint: Constraint-13
*Tie, name=Constraint-13, adjust=yes
s_Surf-24, m_Surf-24
** Constraint: Constraint-14
*Tie, name=Constraint-14, adjust=yes
s_Surf-26, m_Surf-26
** Constraint: Constraint-15
*Tie, name=Constraint-15, adjust=yes
s_Surf-28, m_Surf-28
** Constraint: Constraint-16
*Tie, name=Constraint-16, adjust=yes
s_Surf-30, m_Surf-30
** Constraint: Constraint-17
*Tie, name=Constraint-17, adjust=yes
s_Surf-32, m_Surf-32
** Constraint: Constraint-18
*Tie, name=Constraint-18, adjust=yes
s_Surf-34, m_Surf-34
** Constraint: Constraint-19
*Tie, name=Constraint-19, adjust=yes
s_Surf-36, m_Surf-36
** Constraint: Constraint-20
*Tie, name=Constraint-20, adjust=yes
s_Surf-38, m_Surf-38
** Constraint: Constraint-21
*Tie, name=Constraint-21, adjust=yes
s_Surf-40, m_Surf-40
** Constraint: Constraint-22
*Tie, name=Constraint-22, adjust=yes
s_Surf-42, m_Surf-42
** ... 39 like lines cut
*End Assembly
**
** MATERIALS
**
*Material, name=Material-1
*Density
 0.0029,
*Elastic
7100., 0.32
** ----------------------------------------------------------------
**
** STEP: Step-1
**
*Step, name=Step-1, nlgeom=NO
*Static
0.01, 1., 1e-05, 1.
**
** BOUNDARY CONDITIONS
**
** Name: BC-1 Type: Displacement/Rotation
*Boundary
Set-3, 1, 1
Set-3, 2, 2
Set-3, 3, 3
**
** LOADS
**
** Name: Load-1   Type: Concentrated force
*Cload
Set-2, 3, -250000.
**
** OUTPUT REQUESTS
**
*Restart, write, frequency=0
**
** FIELD OUTPUT: F-Output-1
**
*Output, field, variable=PRESELECT
**
** HISTORY OUTPUT: H-Output-1
**
*Output, history, variable=PRESELECT
*End Step
** ----------------------------------------------------------------
**
** STEP: Step-2
**
*Step, name=Step-2, nlgeom=NO
*Dynamic
0.01,1.,1e-05
**
** OUTPUT REQUESTS
**
*Restart, write, frequency=0
**
** FIELD OUTPUT: F-Output-1
**
*Output, field, variable=PRESELECT, frequency=1
**
** HISTORY OUTPUT: H-Output-1
**
*Output, history, variable=PRESELECT, frequency=1
*End Step